{"text_format":"1","workbook":"xlsx","n_sheets":13,"sheets":["FMS6 Report","Summary Data","1.Notes Mthly","2.Code Order Input","3.Budget Update","AFO Lookup","4.GovApproval","Instructions to CC Summ by CC ","FMS6 Auto Mnthly","Income Check","Check Errors","GBP 2526","School Data"],"not_rendered":{"charts":0,"images":11,"macros":1,"external_links":26,"defined_names":376,"comments":1,"pivot_tables":0},"unopened":[],"bounds":{"document_bytes":16777216,"sheet_cells":100000,"rows_first":2000,"rows_last":500,"rows_between":2000,"halvings":0,"cell_chars":16384,"cell_head_chars":4096},"cells_cut":0,"cells_raw":0,"read":"whole","date_system":"1900"}

{"sheet":"FMS6 Report","index":0,"n_rows":0,"n_cols":0,"rows_kept":0,"cut":false,"hidden":false,"merged":[]}

{"sheet":"Summary Data","index":1,"n_rows":167,"n_cols":3,"rows_kept":167,"cut":false,"hidden":true,"merged":[]}
["School No.",{"$f":"'3.Budget Update'!B3","v":0},{"$f":"'3.Budget Update'!C3","v":""}]
["Actuals to September"]
["Bal Bfwd","B 01",{"$f":"'3.Budget Update'!F5","v":0}]
[null,"B 01",{"$f":"'3.Budget Update'!F6","v":0}]
[null,"B 02",{"$f":"'3.Budget Update'!F7","v":0}]
[null,"B 03",{"$f":"'3.Budget Update'!F8","v":0}]
[null,"B 05",{"$f":"'3.Budget Update'!F9","v":0}]
[null,"B 06",{"$f":"'3.Budget Update'!F10","v":0}]
["INCOME","I 01",{"$f":"'3.Budget Update'!F13","v":0}]
[null,"I 02",{"$f":"'3.Budget Update'!F14","v":0}]
{"$rows_left_out":158}
{"sheet":"1.Notes Mthly","index":2,"n_rows":23,"n_cols":4,"rows_kept":23,"cut":false,"hidden":false,"merged":[[22,1,22,2],[15,1,15,3],[1,1,1,3],[7,1,7,3],[9,1,9,3],[11,1,11,3],[12,2,12,3],[19,1,19,3],[17,1,17,3],[10,1,10,3]]}
[]
[null,"Monthly Budget Monitoring in CFR Format 2025-26"]
[]
[null,"Please enter your School Number in the yellow box below:  ê"]
[]
[null,null,null,{"$f":"IFERROR(INDEX(SchoolNames,MATCH(C6,SchoolLANumbers,0)),\"\")","v":""}]
[]
[null,"The Monthly Budget Forecast can be completed  from an FMS report in addition to your orginal GBP. Link to the instructions is shown below.\n\nThe first step is to enter your school's number in the yellow box.\n\nYour original 2025-26 Governors' Budget Plan data will be seen in Column D on the '3. Budget Update' tab.\n\nBefore importing data into the spreadsheet, review your current budgets and actuals and amend your budgets to reflect any changes, to give an updated 2025-26 year end position."]
[]
[null,"If you use the L.A. Ledger Codes and wish to use the automation in this spreadsheet to complete this Monthly Budget Monitoring Report click this link for instructions."]
{"$rows_left_out":14}
{"sheet":"2.Code Order Input","index":3,"n_rows":335,"n_cols":11,"rows_kept":335,"cut":false,"hidden":false,"merged":[[1,2,1,6],[4,2,4,6],[2,2,2,6],[3,3,3,4]]}
[]
[null,null,{"$f":"IFERROR(CONCATENATE(\"Monthly Budget Monitoring Report 2025-26- \",ReturnType),\"Monthly Budget Monitoring Report 2025-26\")","v":"Monthly Budget Monitoring Report 2025-26"}]
[]
[null,null,"School Name:",{"$f":"IF('1.Notes Mthly'!D6=0,\"\",'1.Notes Mthly'!D6)","v":""},null,"Period",null,"Only select Period if not using FMS import file"]
[]
[null,null,null,null,null,"LA No:",{"$f":"'1.Notes Mthly'!C6","v":0}]
[null,null,"CFR REF:","LEDGER CODE","DESCRIPTION",{"$f":"IFERROR(CONCATENATE(\"Actuals to \",EndDate,\" \",Month),\"Need to Import FMS6 Report\")","v":"Need to Import FMS6 Report"},"Revised 2025-26 Budget Forecast (Outturn) £","CFR Category",null,"Only select Period if not using FMS import file"]
[{"$f":"IF(ISNUMBER(SEARCH(\"*Expenditure*\",H8)),1,IF(OR(ISNUMBER(SEARCH(\"*Income*\",H8)),ISNUMBER(SEARCH(\"*BFWD BALANCES*\",H8))),-1,0))","v":1},null,"E 03",10011,"SCHOOL LIBRARIANS - Pay",{"$f":"SUMIF('FMS6 Report'!$B:$B,$D8&\"*\",'FMS6 Report'!$E:$E)*A8","v":0},{"$f":"SUMIF('FMS6 Report'!$B:$B,$D8&\"*\",'FMS6 Report'!$G:$G)*A8","v":0},{"$f":"IF(C8=\"\",\"\",IF(LEFT(C8,1)=\"E\",\"Revenue Expenditure\",IF(LEFT(C8,1)=\"I\",\"Revenue Income\",IF(LEFT(C8,2)=\"CI\",\"Capital Income\",IF(LEFT(C8,2)=\"CE\",\"Capital Expenditure\",\"Incorrect CFR REF\")))))","v":"Revenue Expenditure"},null,1,"Apr"]
[{"$f":"IF(ISNUMBER(SEARCH(\"*Expenditure*\",H9)),1,IF(OR(ISNUMBER(SEARCH(\"*Income*\",H9)),ISNUMBER(SEARCH(\"*BFWD BALANCES*\",H9))),-1,0))","v":1},null,"E 03",10012,"SCHOOL LIBRARIANS - Sick Pay",{"$f":"SUMIF('FMS6 Report'!$B:$B,$D9&\"*\",'FMS6 Report'!$E:$E)*A9","v":0},{"$f":"SUMIF('FMS6 Report'!$B:$B,$D9&\"*\",'FMS6 Report'!$G:$G)*A9","v":0},"Revenue Expenditure",null,2,"May"]
[1,null,"E 03",10014,"SCHOOL LIBRARIANS - Overtime",{"$f":"SUMIF('FMS6 Report'!$B:$B,$D10&\"*\",'FMS6 Report'!$E:$E)*A10","v":0},{"$f":"SUMIF('FMS6 Report'!$B:$B,$D10&\"*\",'FMS6 Report'!$G:$G)*A10","v":0},"Revenue Expenditure",null,3,"Jun"]
{"$rows_left_out":326}
{"sheet":"3.Budget Update","index":4,"n_rows":106,"n_cols":34,"rows_kept":106,"cut":false,"hidden":false,"merged":[[20,10,20,11],[21,10,21,11],[27,10,27,11],[28,10,28,11],[29,10,29,11],[22,10,22,11],[23,10,23,11],[24,10,24,11],[25,10,25,11],[26,10,26,11],[15,10,15,11],[16,10,16,11],[17,10,17,11],[18,10,18,11],[19,10,19,11],[30,10,30,11],[31,10,31,11],[32,10,32,11],[101,3,101,4],[1,1,1,6],[4,6,9,6],[2,10,2,11],[4,10,4,11],[5,10,5,11],[6,10,6,11],[7,10,7,11],[8,10,8,11],[9,10,9,11],[12,10,12,11],[13,10,13,11],[14,10,14,11]]}
["PERIOD",{"$f":"IF(ISBLANK('FMS6 Report'!$L$1),'2.Code Order Input'!G4,'FMS6 Report'!$L$1)","v":0},null,null,null,null,null,null,null,null,null,null,null,null,null,null,null,null,null,null,null,null,null,null,null,null,null,"Percentage Range:",10,0.1]
[null,{"$f":"IFERROR(CONCATENATE(\"Monthly Budget Monitoring Report - \",ReturnType),\"Monthly Budget Monitoring Report\")","v":"Monthly Budget Monitoring Report"},null,null,null,null,null,null,null,null,null,null,null,null,null,null,null,null,null,null,null,null,null,null,null,null,null,null,"Range 1","Range 2",null,null,"Range 1","Range 2"]
["SCH No",{"$f":"'2.Code Order Input'!G6","v":0},{"$f":"'2.Code Order Input'!D4","v":""},"Original 2025-26 Budget","Revised 2025-26 Budget Forecast",{"$f":"IFERROR(CONCATENATE(\"Actuals April to \",Month),\"Need to Import FMS6 Report\")","v":"Need to Import FMS6 Report"},"Actual as % Revised Budget",null,null,"Pro-Rata Variance Warning","Revised Budget Warning",null,"Please provide an explanation for any Warnings in the cells below",null,null,null,"Look Up Ref","Actual > Revised Budget",null,null,null,null,"Period",null,"Month","Return","End Date","Percentage Pro-Rata","Lower Range","Higher Range",null,"Percentage Pro-Rata 13 Months","Lower Range","Higher Range"]
[null,"CFR","BALANCES BROUGHT FORWARD FROM 2024-25","£","£","£",null,null,null,null,null,null,null,null,null,"CFR different to GBP",null,null,null,null,null,null,1,"Apr","April","1 Month Return","30th",8.3333333333333329E-2,7.4999999999999997E-2,9.1666666666666674E-2,null,0.16666666666666666,0.15,0.18333333333333335]
[{"$f":"'GBP 2526'!I1","v":9},"B 01","Committed Revenue balance",{"$f":"IFERROR(VLOOKUP('3.Budget Update'!$B$3,'GBP 2526'!$A$5:$CX$160,$A5,FALSE),0)","v":0},{"$f":"'2.Code Order Input'!$G$241","v":0},{"$f":"'2.Code Order Input'!$F$241","v":0},"CFR Brought Forward Balances",null,null,{"$f":"IF(OR(E5<D5-1,E5>D5+1),\"CFR different to GBP\",\"\")","v":""},{"$f":"IF(OR(E5<F5-1,E5>F5+1),\"Actuals different to Org GBP\",\"\")","v":""},null,null,null,"Actual high % budget","Actuals different to Org GBP",5,null,null,"Report Date",{"$f":"IF(ISBLANK('FMS6 Report'!$L$1),'2.Code Order Input'!G4,'FMS6 Report'!$L$1)","v":0},null,2,"May","May","2 Months Return","31st",0.16666666666666666,0.15,0.18333333333333335,null,0.25,0.22500000000000001,0.27500000000000002]
[{"$f":"'GBP 2526'!J1","v":10},"B 01","Committed revenue balance - revenue grants",{"$f":"IFERROR(VLOOKUP('3.Budget Update'!$B$3,'GBP 2526'!$A$5:$CX$160,$A6,FALSE),0)","v":0},{"$f":"'2.Code Order Input'!$G$242","v":0},{"$f":"'2.Code Order Input'!$F$242","v":0},null,null,null,"",{"$f":"IF(OR(E6<F6-1,E6>F6+1),\"Actuals different to Org GBP\",\"\")","v":""},null,null,null,"Actual high % budget","Increase Revised Budget?",6,null,null,null,null,null,3,"Jun","June","Quarter-Year Return","30th",0.25,0.22500000000000001,0.27500000000000002,null,0.33333333333333331,0.3,0.3666666666666667]
[11,"B 02",{"$f":"IF(F7>0,\"Revenue Balance subject to clawback hence will not carry forward\",\"Uncommitted Revenue balance\")","v":"Uncommitted Revenue balance"},{"$f":"IFERROR(VLOOKUP('3.Budget Update'!$B$3,'GBP 2526'!$A$5:$CX$160,$A7,FALSE),0)","v":0},{"$f":"SUMIF('2.Code Order Input'!$C$8:$C$327,B7,'2.Code Order Input'!$G$8:$G$327)","v":0},{"$f":"SUMIF('2.Code Order Input'!$C$8:$C$327,B7,'2.Code Order Input'!$F$8:$F$327)","v":0},null,null,null,"","",null,null,null,"Actual but no budget","Reduce Revised Budget?",7,null,null,"Month",{"$f":"INDEX(Y4:Y15,MATCH(B1,X4:X15,FALSE),1)","v":{"$error":"#N/A"}},null,4,"Jul","July","4 Months Return","31st",0.33333333333333331,0.3,0.3666666666666667,null,0.41666666666666663,0.375,0.45833333333333331]
[12,"B 03","Devolved Formula Capital balance",{"$f":"IFERROR(VLOOKUP('3.Budget Update'!$B$3,'GBP 2526'!$A$5:$CX$160,$A8,FALSE),0)","v":0},{"$f":"SUMIF('2.Code Order Input'!$C$8:$C$327,B8,'2.Code Order Input'!$G$8:$G$327)","v":0},{"$f":"SUMIF('2.Code Order Input'!$C$8:$C$327,B8,'2.Code Order Input'!$F$8:$F$327)","v":0},null,null,null,"","",null,null,null,"Actual low % budget","Actual but no Revised Budget?",8,null,null,"End Date",{"$f":"INDEX(EndDateRange,MATCH(Month,MonthRange,0))","v":{"$error":"#N/A"}},null,5,"Aug","August","5 Months Return","31st",0.41666666666666663,0.375,0.45833333333333331,null,0.5,0.45,0.55000000000000004]
[13,"B 05","Other Capital balances",{"$f":"IFERROR(VLOOKUP('3.Budget Update'!$B$3,'GBP 2526'!$A$5:$CX$160,$A9,FALSE),0)","v":0},{"$f":"SUMIF('2.Code Order Input'!$C$8:$C$327,B9,'2.Code Order Input'!$G$8:$G$327)","v":0},{"$f":"SUMIF('2.Code Order Input'!$C$8:$C$327,B9,'2.Code Order Input'!$F$8:$F$327)","v":0},null,null,null,"","",null,null,null,null,"Actual Income % Higher than Pro-Rata % Income",9,null,null,null,null,null,6,"Sep","September","Half-Year Return","30th",0.5,0.45,0.55000000000000004,null,0.58333333333333326,0.52499999999999991,0.64166666666666661]
[14,"B 06","Community Focused extended school balances",{"$f":"IFERROR(VLOOKUP('3.Budget Update'!$B$3,'GBP 2526'!$A$5:$CX$160,$A10,FALSE),0)","v":0},{"$f":"SUMIF('2.Code Order Input'!$C$8:$C$327,B10,'2.Code Order Input'!$G$8:$G$327)","v":0},{"$f":"SUMIF('2.Code Order Input'!$C$8:$C$327,B10,'2.Code Order Input'!$F$8:$F$327)","v":0},null,null,null,"","",null,null,null,null,"Actual Income % Lower than Pro-Rata % Income",10,null,null,"Return",{"$f":"INDEX(ReturnRange,MATCH(Month,MonthRange,0))","v":{"$error":"#N/A"}},null,7,"Oct","October","7 Months Return","31st",0.58333333333333326,0.52499999999999991,0.64166666666666661,null,0.66666666666666663,0.6,0.73333333333333339]
{"$rows_left_out":97}
{"sheet":"AFO Lookup","index":5,"n_rows":17,"n_cols":20,"rows_kept":17,"cut":false,"hidden":true,"merged":[]}
[]
["Report =",{"$f":"'FMS6 Report'!$L$1","v":0},null,null,null,"Percentage Range:",10,{"$f":"1/G2","v":0.1}]
[]
["Period",null,"Month","Return","End Date","Percentage Pro-Rata","Lower Range","Higher Range",null,"Percentage Pro-Rata 13 Months","Lower Range","Higher Range"]
[1,"Apr","April","1 Month Return","30th",{"$f":"(1/12)*A5","v":8.3333333333333329E-2},{"$f":"F5*(1-$H$2)","v":7.4999999999999997E-2},{"$f":"F5*(1+$H$2)","v":9.1666666666666674E-2},null,{"$f":"(1/12)*A6","v":0.16666666666666666},{"$f":"J5*(1-$H$2)","v":0.15},{"$f":"J5*(1+$H$2)","v":0.18333333333333335},null,null,null,null,null,null,null,{"$f":"INDEX('AFO Lookup'!C5:C16,match)","v":{"$error":"#NAME?"}}]
[2,"May","May","2 Months Return","31st",{"$f":"(1/12)*A6","v":0.16666666666666666},{"$f":"F6*(1-$H$2)","v":0.15},{"$f":"F6*(1+$H$2)","v":0.18333333333333335},null,{"$f":"(1/12)*A7","v":0.25},{"$f":"J6*(1-$H$2)","v":0.22500000000000001},{"$f":"J6*(1+$H$2)","v":0.27500000000000002}]
[3,"Jun","June","Quarter-Year Return","30th",0.25,0.22500000000000001,0.27500000000000002,null,0.33333333333333331,0.3,0.3666666666666667]
[4,"Jul","July","4 Months Return","31st",0.33333333333333331,0.3,0.3666666666666667,null,{"$f":"(1/12)*A9","v":0.41666666666666663},0.375,0.45833333333333331]
[5,"Aug","August","5 Months Return","31st",0.41666666666666663,0.375,0.45833333333333331,null,0.5,0.45,0.55000000000000004]
[6,"Sep","September","Half-Year Return","30th",0.5,0.45,0.55000000000000004,null,0.58333333333333326,0.52499999999999991,0.64166666666666661]
{"$rows_left_out":8}
{"sheet":"4.GovApproval","index":6,"n_rows":24,"n_cols":7,"rows_kept":24,"cut":false,"hidden":false,"merged":[[1,1,1,7],[14,2,14,6],[26,1,26,5],[22,1,22,7],[23,1,23,7],[19,1,19,7],[21,1,21,7],[20,1,20,5],[20,6,20,7],[17,2,17,6],[15,2,15,3],[3,2,3,6],[9,2,9,6],[4,2,4,6],[10,4,10,6],[12,5,12,6],[6,2,6,6]]}
[]
[null,{"$f":"IFERROR(CONCATENATE(\"Governors' Budget Plan \",Month,\" Budget Forecast 2025-26\"),\"Governors' Budget Plan Budget Forecast 2025-26\")","v":"Governors' Budget Plan Budget Forecast 2025-26"}]
[]
[null,null,{"$f":"IFERROR(CONCATENATE(\"I confirm that the submitted 'Governors' Budget Plan \",Month,\" Budget Forecast 2025-26' has been agreed by the Governing Body, and that the budget has been prepared in accordance with the Best Value principles as set out in Annex C of the Fair Funding Scheme for schools.\"),\"I confirm that the submitted 'Governors' Budget Plan September Budget Forecast 2025-26' has been agreed by the Governing Body.\")","v":"I confirm that the submitted 'Governors' Budget Plan September Budget Forecast 2025-26' has been agreed by the Governing Body."}]
[null,null,"Scheme for financing maintained schools (gloucestershire.gov.uk)"]
[]
[null,null,"This slip should be signed by either your Chair of Governors or Chair of Finance Committee, but does not need to be approved at a Governors' meeting."]
[]
[null,null,null,null,null,"School LA Cost Centre Number:",{"$f":"'1.Notes Mthly'!C6","v":0}]
[null,null,{"$f":"'3.Budget Update'!C3","v":""}]
{"$rows_left_out":15}
{"sheet":"Instructions to CC Summ by CC ","index":7,"n_rows":40,"n_cols":2,"rows_kept":40,"cut":false,"hidden":true,"merged":[[2,1,2,2]]}
[]
[null,"Cost Centre Summary by Cost Centre Report"]
[]
[]
[]
[null,"On FMS access the report by following the route below:"]
[]
[null,"Reports/General Ledger/Transactions/Cost Centre Summary Transactions/ Cost Centre Summary by Cost Centre"]
[]
[null,"Do not change or choose any criteria and press ok"]
{"$rows_left_out":31}
{"sheet":"FMS6 Auto Mnthly","index":8,"n_rows":101,"n_cols":3,"rows_kept":101,"cut":false,"hidden":false,"merged":[]}
[]
[null,null,"Click here to return to '1.Notes'! tab"]
[]
[null,null,"Please print these instructions"]
[]
[null,null,"Monthly Budget Monitoring in CFR Format 2025-26"]
[]
[null,null,"It is intended that the completion of the return be automated as far as possible. I have detailed below instructions on how to produce the Monthly Budget Plan. The instructions need to be carried out on a computer that runs FMS6."]
[]
[null,null,"If you wish to take advantage of the automation within the Monthly Budget Plan spreadsheet you must also check that a folder called GBP exists on the  Local Disk C of the computer. If it does not you need to create it. The folder  must be called GBP. "]
{"$rows_left_out":92}
{"sheet":"Income Check","index":9,"n_rows":28,"n_cols":5,"rows_kept":28,"cut":false,"hidden":false,"merged":[[1,1,1,4]]}
[]
[null,"You only need to complete this tab if you completed the September Budget Plan Manually using IE reports from FMS6"]
[null,null,null,null,"Actual"]
[null,null,null,null,"to end of"]
[null,"CFR","Ledger",null,"September"]
[null,"Line","Code","Code Description","£"]
[]
[null,"I 01",73012,"Excluded Pupil Funding Adjustment",{"$f":"'2.Code Order Input'!F229","v":0}]
[null,"I 01",73000,"SCHOOL ORIGINAL DELEGATED BUDGET (I.S.B.)",{"$f":"'2.Code Order Input'!F222","v":0}]
[null,"I 01",73002,"I.S.B. CONTINGENCY BUDGET INCREASES",{"$f":"'2.Code Order Input'!F223","v":0}]
{"$rows_left_out":19}
{"sheet":"Check Errors","index":10,"n_rows":5,"n_cols":7,"rows_kept":5,"cut":false,"hidden":false,"merged":[[3,1,3,6]]}
[]
[null,"Please print this sheet and return to your instructions"]
[]
[null,"Please investigate:-\nThe following Ledger Code(s) do not appear on the standard code list."]
[null,"Ledger Code","Code Centre","Budget",null,null,"Actual"]

{"sheet":"GBP 2526","index":11,"n_rows":239,"n_cols":137,"rows_kept":239,"cut":false,"hidden":true,"merged":[[2,113,2,115],[2,116,2,118],[2,8,2,14],[2,15,2,36],[2,37,2,78],[2,79,2,83],[2,84,2,94],[2,95,2,100]]}
[1,2,3,4,5,6,7,8,9,10,11,12,13,14,15,16,17,18,19,20,21,22,23,24,25,26,27,28,29,30,31,32,33,34,35,36,37,38,39,40,41,42,43,44,45,46,47,48,49,50,51,52,53,54,55,56,{"$f":"BD1+1","v":57},{"$f":"BE1+1","v":58},59,60,{"$f":"BH1+1","v":61},62,63,64,65,66,67,68,69,70,71,72,73,74,75,76,77,78,79,80,81,82,83,84,85,86,87,88,89,90,91,92,93,94,95,96,97,98,99,100,101,102,103,104,105,106,107,108,109,110,111,112,113,114,115,116,117,118,119,120,121,122,123,124,{"$f":"DT1+1","v":125},126,127,128,129,130,131,132,133,134,135,136,137]
[null,null,null,null,null,null,null,null,null,null,null,null,null,null,null,{"$f":"Q2-1","v":13},14,15,16,17,18,19,20,21,22,23,24,25,26,27,28,29,30,31,{"$f":"AJ2-1","v":32},33,null,36,{"$f":"AL2+1","v":37},{"$f":"AM2+1","v":38},39,40,41,42,43,44,45,46,47,48,49,50,51,52,53,54,{"$f":"BD2+1","v":55},{"$f":"BE2+1","v":56},57,58,{"$f":"BH2+1","v":59},60,61,62,63,64,65,66,67,68,69,70,71,72,73,74,75,76,77,78,79,80,81,82,83,84,85,86,87,88,89,90,91,92,93,94,95,96,97,98,99,100,101,102,103,104,105,106,107,108,109,110,111,112,113,114,115,116,117,118,119,120,121,122,{"$f":"DT2+1","v":123},124,125,126,127,128,129,130,131,132,133,134,135]
[null,null,null,null,null,null,null,null,"Balances Brought Forward",null,null,null,null,null,null,"Revenue Income",null,null,null,null,null,null,null,null,null,null,null,null,null,null,null,null,null,null,null,null,null,"Revenue Expenditure",null,null,null,null,null,null,null,null,null,null,null,null,null,null,null,null,null,null,null,null,null,null,null,null,null,null,null,null,null,null,null,null,null,null,null,null,null,null,null,null,null,"Capital Income",null,null,null,null,"Capital Expenditure",null,null,null,null,null,null,null,null,null,null,"Balances Carried Forward",null,null,null,null,null,null,null,null,null,null,null,null,null,null,null,null,null,"Opening Balances",null,null,"Closing Balances",null,null,null,"& S/School/Spec Budget/1718/1718 budget estimate tool Final - April 2017"]
["School LA Number","DfE No","DfE No (shortened)","URN","School Name","Type 2","EstablishmentTypeGroup (name)","Bank Account","B 01","B 01_01","B 02","B 03","B 05","B 06","Total","I 01","I 02","I 03","I 04","I 05","I 06","I 07","I 08a","I 08b","I 09","I 10","I 11","I 12","I 13","I 15","I 16","I 17","I 18A","I 18B","I 18C","I 18D","Total","E 01","E 02","E 03","E 04","E 05","E 06","E 07","E 08","E 09","E 10","E 11","E 12","E 13","E 14","E 15","E 16","E 17","E 18","E 19","E 20","E 20A","E 20B","E 20C","E 20D","E 20E","E 20F","E 20G","E 21","E 22","E 23","E 24","E 25","E 26","E 27","E 28A","E 28B","E 29","E 30","E 31","E 32","Total",null,"CI 01","CI 03","CI 04","Total",null,"CE 01","CE 02","CE 03","CE 04","CE 04A","CE 04B","CE 04C","CE 04D","CE 04E","Total",null,"B 01","B 01_01","B 02","B 03","B 05","B 06","Total",null,null,null,null,null,null,null,null,null,null,null,"Revenue","Capital","Total","Revenue","Capital","Total",null,"ISB 22-23","ISB vs Total Income %","Employees vs Core Income % "]
[784,9162066,2066,null,"Soudley School",null,null,null,67010.739999999932,2209.14,0,14446.21,0,1700.5799999999981,85366.66999999994,416914,0,61766,0,13235,24866,0,0,3200,0,0,0,0,0,0,21000,0,0,0,0,0,540981,225329,14000,141974,21866,27935,0,17210,2500,2500,844,0,11174,1895,0,2100,11000,8883,1500,13722,0,5000,0,2159,1591,0,2000,2500,0,625,1494,0,12649,2000,9683,13970,0,0,0,22701,0,580804,null,4630,0,0,4630,null,0,19076,0,0,0,0,0,0,0,19076,null,31097.879999999936,0,0,0.20999999999912689,0,-0.42000000000189175,31097.669999999933]
[583,9162138,2138,null,"Cam Woodfield Infant School",null,null,null,14193.050000000034,9451.8700000000008,0,11438.560000000001,0,0,35083.48000000004,888165,0,59786,0,48840,58567,0,0,0,5000,0,0,0,0,0,0,0,0,0,0,0,1060358,545031,2000,294992,8490,37873,0,12498,4541,4000,7488,0,11436,1562,18435,2500,8500,12226,4442,28928,0,2700,0,8500,0,3000,0,4002,0,3355,8151,0,59252,13000,24124,11586,0,0,0,0,0,1142612,null,5474,0,0,5474,null,0,12913,0,0,0,0,1000,3000,0,16913,null,-58609.079999999965,0,0,-0.43999999999869033,0,0,-58609.51999999996]
[125,9167019,7019,null,"Alderman Knight School",null,null,null,2753532.5599999987,22080.510000000009,0,9700.8400000000038,0,0,2785313.9099999983,2521029,0,2677940,0,79550,16386,0,0,94500,0,0,0,40000,4500,0,0,0,0,0,0,0,5433905,2682822,45390,1893494,87972,504044,0,0,27745,20000,0,0,91300,5450,84150,9000,63000,0,7800,176096,0,4962,0,10635,37675,20000,4832,2596,30000,36161,36474,0,23395,0,115952,90961,0,0,536980,0,0,6648886,null,15188,0,536980,552168,null,0,561869,0,0,0,0,0,0,0,561869,null,1560632.0699999984,0,0,-0.1599999999962165,0,0,1560631.9099999985]
[925,9162034,2034,null,"Dinglewell Infant School",null,null,null,131799.76000000024,0,0,0,0,0,131799.76000000024,1248660,0,55721,0,23325,152686,0,2300,88800,0,0,0,0,0,0,0,0,0,0,0,0,1571492,826396,15000,288745,20793,61546,0,73484,6030,9360,769,0,16792,0,24183,5300,11150,0,2484,43239,0,4194,0,6583,6139,1000,18000,4975,0,7180,13933,0,121995,0,0,16034,0,0,0,0,0,1605304,null,7026,0,0,7026,null,0,7026,0,0,0,0,0,0,0,7026,null,97987.760000000242,0,0,0,0,0,97987.760000000242]
[139,9167017,7017,null,"The Shrubberies School",null,null,null,45813.040000000692,1174,0,0.25,0,0,46987.290000000692,1552602,0,2022642,0,79725,24913,0,0,40000,0,0,0,0,0,0,0,0,0,0,0,0,3719882,1542730,0,1537632,39423,146969,0,56877,15500,13000,5000,17000,12985,6500,69505,8000,73000,0,16350,37825,0,6500,0,12200,600,3000,0,7972,0,4050,23728,6400,29525,0,18600,26502,0,0,0,0,0,3737373,null,10784,0,0,10784,null,0,10784,0,0,0,0,0,0,0,10784,null,29496.040000000692,0,0,0.25,0,0,29496.290000000692]
[827,9162101,2101,null,"Twyning School",null,null,null,82874.320000000022,4018.5,0,-1.8189894035458565E-12,0,0,86892.820000000022,792807,0,92917,0,17780,42430,0,380,22720,0,3080,0,20500,500,0,0,0,0,0,0,0,993114,473795,13000,168211,23015,58076,0,47523,4114,2864,393,7132,8481,1700,2060,3630,20000,12725,4400,55880,0,3090,0,12508,3527,0,0,5355,0,2854,6963,0,33617,0,13800,15016,0,0,0,0,0,1003729,null,5451,0,0,5451,null,0,5451,0,0,0,0,0,0,0,5451,null,76277.820000000022,0,0,-1.8189894035458565E-12,0,0,76277.820000000022]
{"$rows_left_out":230}
{"sheet":"School Data","index":12,"n_rows":302,"n_cols":20,"rows_kept":302,"cut":false,"hidden":true,"merged":[]}
["School LA Number","EstablishmentName","DfE No","DfE No (shortened)","URN","Type","Type 2","EstablishmentTypeGroup (name)","TypeOfEstablishment (name)","Planned Conversion Date","TRUST NAME","Bank Account School/Academy","Vendor Number","Debtor Number","Central School Cost Centre"]
[1108,"Abbey View",9161108,1108,139660,"Not applicable","Free Schools","Free schools alternative provision","Free schools alternative provision",null,"CCT LEARNING","Yes",163336,113468,null,"Tewkesbury",null,null,null,{"$f":"A2","v":1108}]
[529,"Abbeymead Primary School",9162172,2172,115601,"Primary","Local authority maintained schools","Community school","Community school",null,null,null,null,null,107529,"Gloucester",null,null,null,{"$f":"A3","v":529}]
[125,"Alderman Knight School",9167019,7019,115825,"Not applicable","Special schools","Community special school","Community special school",null,null,null,null,null,107125,"Tewkesbury",null,null,null,125]
[382,"All Saints' Academy, Cheltenham",9166905,6905,136016,"Secondary","Academies","Academy sponsor led","Academy sponsor led","2011-09-01","ALL SAINTS' ACADEMY, CHELTENHAM","Yes",149270,110437,null,"Tewkesbury",null,null,null,382]
[530,"Amberley Parochial School",9163334,3334,149830,"Primary","Academies","Academy converter","Academy converter","2023-06-01","THE DIOCESE OF GLOUCESTER ACADEMIES TRUST","Yes",201854,122638,null,"Stroud",null,null,null,530]
[531,"Ampney Crucis Church of England Primary School",9163308,3308,115673,"Primary","Local authority maintained schools","Voluntary aided school","Voluntary aided school",null,null,null,null,null,107531,"South Cotswolds",null,null,null,531]
[532,"Andoversford Primary School",9165205,5205,115735,"Primary","Local authority maintained schools","Foundation school","Foundation school",null,null,"Yes",101529,100533,null,"North Cotswolds",null,null,null,532]
[632,"Ann Cam Church of England Primary School",9163323,3323,149677,"Primary","Academies","Academy converter","Academy converter","2023-04-01","PRIMARY QUEST MULTI-ACADEMY TRUST","Yes",200420,122447,null,"Forest of Dean",null,null,null,632]
[786,"Ann Edwards Church of England Primary School",9163069,3069,115650,"Primary","Local authority maintained schools","Voluntary controlled school","Voluntary controlled school",null,null,null,null,null,107786,"South Cotswolds",null,null,null,786]
{"$rows_left_out":292}